Reaction Details
TargetMuscarinic acetylcholine receptor M3
LigandBDBM50416141
Substrate/Competitorn/a
Meas. Tech.ChEMBL_635228 (CHEMBL1117839)
IC50 39.81±n/a nM
Citation Budzik, BGarzya, VShi, DWalker, GLauchart, YLucas, AJRivero, RALangmead, CJWatson, JWu, ZForbes, ITJin, J 2' biaryl amides as novel and subtype selective M1 agonists. Part II: Further optimization and profiling. Bioorg Med Chem Lett20:3545-9 (2010) 
 
Muscarinic acetylcholine receptor M3
Name:Muscarinic acetylcholine receptor M3
Type:Enzyme
Mol. Mass.:66151.03
Organism:Homo sapiens (Human)
Description:P20309
Residue:590
BDBM50416141
NameBDBM50416141
Synonyms:CHEMBL1083925
TypeSmall organic molecule
Emp. Form.C20H22ClFN2O
Mol. Mass.360.853
SMILESC[C@H]1CNCC[C@@H]1CNC(=O)c1c(F)cccc1-c1cccc(Cl)c1