Reaction Details
TargetMuscarinic acetylcholine receptor M3
LigandBDBM50416164
Substrate/Competitorn/a
Meas. Tech.ChEMBL_635228 (CHEMBL1117839)
IC50 19.95±n/a nM
Citation Budzik, BGarzya, VShi, DWalker, GLauchart, YLucas, AJRivero, RALangmead, CJWatson, JWu, ZForbes, ITJin, J 2' biaryl amides as novel and subtype selective M1 agonists. Part II: Further optimization and profiling. Bioorg Med Chem Lett20:3545-9 (2010) 
 
Muscarinic acetylcholine receptor M3
Name:Muscarinic acetylcholine receptor M3
Type:Enzyme
Mol. Mass.:66151.03
Organism:Homo sapiens (Human)
Description:P20309
Residue:590
BDBM50416164
NameBDBM50416164
Synonyms:CHEMBL1083402
TypeSmall organic molecule
Emp. Form.C19H22ClNO2S
Mol. Mass.363.901
SMILESClc1cccc(c1)-c1ccccc1S(=O)(=O)CCC1CCNCC1