Reaction Details
TargetC-C chemokine receptor type 2
LigandBDBM50416283
Substrate/Competitorn/a
Meas. Tech.ChEMBL_640105 (CHEMBL1174375)
Ki 3.16±n/a nM
Citation Peace, SPhilp, JBrooks, CPiercy, VMoores, KSmethurst, CWatson, SGaines, SZippoli, MMookherjee, CIfe, R Identification of a sulfonamide series of CCR2 antagonists. Bioorg Med Chem Lett20:3961-4 (2010) 
 
C-C chemokine receptor type 2
Name:C-C chemokine receptor type 2
Type:Enzyme
Mol. Mass.:41932.32
Organism:Homo sapiens (Human)
Description:P41597
Residue:374
BDBM50416283
NameBDBM50416283
Synonyms:CHEMBL1170829
TypeSmall organic molecule
Emp. Form.C18H11Cl3N2O5S
Mol. Mass.473.714
SMILESOC(=O)c1ccc(Oc2ncc(Cl)cc2NS(=O)(=O)c2ccc(Cl)c(Cl)c2)cc1