Reaction Details
TargetC-C chemokine receptor type 4
LigandBDBM50416285
Substrate/Competitorn/a
Meas. Tech.ChEMBL_640125 (CHEMBL1174525)
Ki 794.33±n/a nM
Citation Peace, SPhilp, JBrooks, CPiercy, VMoores, KSmethurst, CWatson, SGaines, SZippoli, MMookherjee, CIfe, R Identification of a sulfonamide series of CCR2 antagonists. Bioorg Med Chem Lett20:3961-4 (2010) 
 
C-C chemokine receptor type 4
Name:C-C chemokine receptor type 4
Type:Enzyme
Mol. Mass.:41406.41
Organism:Homo sapiens (Human)
Description:P51679
Residue:360
BDBM50416285
NameBDBM50416285
Synonyms:CHEMBL1171008
TypeSmall organic molecule
Emp. Form.C18H11Cl3N2O5S
Mol. Mass.473.714
SMILESOC(=O)c1ccccc1Oc1ncc(Cl)cc1NS(=O)(=O)c1ccc(Cl)c(Cl)c1