Reaction Details
TargetNeuronal acetylcholine receptor subunit alpha-7
LigandBDBM50416405
Substrate/Competitorn/a
Meas. Tech.ChEMBL_643567 (CHEMBL1212431)
EC50 6.31±n/a nM
Citation Capelli, AMCastelletti, LSalvagno, COliosi, BDi Lenarda, EVirginio, CLightfoot, AKew, JNTeague, S Identification of novel alpha7 nAChR positive allosteric modulators with the use of pharmacophore in silico screening methods. Bioorg Med Chem Lett20:4561-5 (2010) 
 
Neuronal acetylcholine receptor subunit alpha-7
Name:Neuronal acetylcholine receptor subunit alpha-7
Type:n/a
Mol. Mass.:56448.33
Organism:Homo sapiens (Human)
Description: CHRNA7 (NACHRA7)
Residue:502
BDBM50416405
NameBDBM50416405
Synonyms:CHEMBL1210576
TypeSmall organic molecule
Emp. Form.C25H27N3O
Mol. Mass.385.5014
SMILESO=C(Cc1nc(C2CCCCC2)c2ccccc2n1)NC1Cc2ccccc2C1