Reaction Details
TargetNeuronal acetylcholine receptor subunit alpha-7
LigandBDBM50416406
Substrate/Competitorn/a
Meas. Tech.ChEMBL_643567 (CHEMBL1212431)
EC50 10±n/a nM
Citation Capelli, AMCastelletti, LSalvagno, COliosi, BDi Lenarda, EVirginio, CLightfoot, AKew, JNTeague, S Identification of novel alpha7 nAChR positive allosteric modulators with the use of pharmacophore in silico screening methods. Bioorg Med Chem Lett20:4561-5 (2010) 
 
Neuronal acetylcholine receptor subunit alpha-7
Name:Neuronal acetylcholine receptor subunit alpha-7
Type:n/a
Mol. Mass.:56448.33
Organism:Homo sapiens (Human)
Description: CHRNA7 (NACHRA7)
Residue:502
BDBM50416406
NameBDBM50416406
Synonyms:CHEMBL1210518
TypeSmall organic molecule
Emp. Form.C28H32N4O3
Mol. Mass.472.5787
SMILESCOc1ccc(Cc2cc(nn(CC(=O)NC3Cc4ccccc4C3)c2=O)C2CCCCC2)cn1