Reaction Details
TargetCannabinoid receptor 1
LigandBDBM50416465
Substrate/Competitorn/a
Meas. Tech.ChEMBL_644193 (CHEMBL1212092)
EC50 158.49±n/a nM
Citation Kiyoi, TYork, MFrancis, SEdwards, DWalker, GHoughton, AKCottney, JEBaker, JAdam, JM Design, synthesis, and structure-activity relationship study of conformationally constrained analogs of indole-3-carboxamides as novel CB1 cannabinoid receptor agonists. Bioorg Med Chem Lett20:4918-21 (2010) 
 
Cannabinoid receptor 1
Name:Cannabinoid receptor 1
Type:G Protein-Coupled Receptor (GPCR)
Mol. Mass.:52868.96
Organism:Homo sapiens (Human)
Description:P21554
Residue:472
BDBM50416465
NameBDBM50416465
Synonyms:CHEMBL1209575
TypeSmall organic molecule
Emp. Form.C23H33N3O2
Mol. Mass.383.527
SMILESCCN1CCN(CC1)C(=O)c1cn(CC2CCCCC2)c2c(OC)cccc12