Reaction Details
TargetCannabinoid receptor 1
LigandBDBM50416473
Substrate/Competitorn/a
Meas. Tech.ChEMBL_644193 (CHEMBL1212092)
EC50 25.12±n/a nM
Citation Kiyoi, TYork, MFrancis, SEdwards, DWalker, GHoughton, AKCottney, JEBaker, JAdam, JM Design, synthesis, and structure-activity relationship study of conformationally constrained analogs of indole-3-carboxamides as novel CB1 cannabinoid receptor agonists. Bioorg Med Chem Lett20:4918-21 (2010) 
 
Cannabinoid receptor 1
Name:Cannabinoid receptor 1
Type:G Protein-Coupled Receptor (GPCR)
Mol. Mass.:52868.96
Organism:Homo sapiens (Human)
Description:P21554
Residue:472
BDBM50416473
NameBDBM50416473
Synonyms:CHEMBL1209709
TypeSmall organic molecule
Emp. Form.C23H33N3O2
Mol. Mass.383.527
SMILESCOc1cccc2c(cn(CC3CCCCC3)c12)C(=O)N1CCN(C)[C@@H](C)C1