Reaction Details
TargetCannabinoid receptor 2
LigandBDBM50416474
Substrate/Competitorn/a
Meas. Tech.ChEMBL_644195 (CHEMBL1212094)
Ki 0.398±n/a nM
Citation Kiyoi, TYork, MFrancis, SEdwards, DWalker, GHoughton, AKCottney, JEBaker, JAdam, JM Design, synthesis, and structure-activity relationship study of conformationally constrained analogs of indole-3-carboxamides as novel CB1 cannabinoid receptor agonists. Bioorg Med Chem Lett20:4918-21 (2010) 
 
Cannabinoid receptor 2
Name:Cannabinoid receptor 2
Type:G Protein-Coupled Receptor (GPCR)
Mol. Mass.:39690.94
Organism:Homo sapiens (Human)
Description:P34972
Residue:360
BDBM50416474
NameBDBM50416474
Synonyms:CHEMBL1209710
TypeSmall organic molecule
Emp. Form.C23H31N3O2
Mol. Mass.381.5111
SMILESC[C@H]1CN(CCN1C)C(=O)c1cn2[C@@H](COc3cccc1c23)C1CCCCC1