Reaction Details
TargetD(3) dopamine receptor
LigandBDBM50416713
Substrate/Competitorn/a
Meas. Tech.ChEMBL_652494 (CHEMBL1225697)
Ki 2.51±n/a nM
Citation Micheli, FHamprecht, DBonanomi, GDi Fabio, RDonati, DGentile, GHeidbreder, CPrandi, ATarsi, LTerreni, S [3-azabicyclo[3.1.0]hex-1-yl]phenyl-benzenesulfonamides as selective dopamine D3 antagonists. Bioorg Med Chem Lett20:5491-4 (2010) 
 
D(3) dopamine receptor
Name:D(3) dopamine receptor
Type:n/a
Mol. Mass.:44243.43
Organism:Homo sapiens (Human)
Description:n/a
Residue:400
BDBM50416713
NameBDBM50416713
Synonyms:CHEMBL1224638
TypeSmall organic molecule
Emp. Form.C20H24N2O2S
Mol. Mass.356.482
SMILESCC(C)c1ccc(cc1)S(=O)(=O)Nc1ccc(cc1)[C@@]12C[C@@H]1CNC2