Reaction Details
TargetAlpha-2C adrenergic receptor
LigandBDBM50417010
Substrate/Competitorn/a
Meas. Tech.ChEMBL_664777 (CHEMBL1259387)
Ki 0.169824±n/a nM
Citation Vacher, BFunes, PChopin, PCussac, DHeusler, PTourette, AMarien, M Rigid analogues of thea2-adrenergic blocker atipamezole: small changes, big consequences. J Med Chem53:6986-95 (2010) 
 
Alpha-2C adrenergic receptor
Name:Alpha-2C adrenergic receptor
Type:Enzyme
Mol. Mass.:49552.32
Organism:Homo sapiens (Human)
Description:P18825
Residue:462
BDBM50417010
NameBDBM50417010
Synonyms:CHEMBL1255723
TypeSmall organic molecule
Emp. Form.C15H16N2
Mol. Mass.224.3009
SMILESCC[C@H]1[C@@H]2c3ccccc3C[C@]12c1cnc[nH]1