Reaction Details
TargetMineralocorticoid receptor
LigandBDBM19214
Substrate/Competitorn/a
Meas. Tech.ChEMBL_664902 (CHEMBL1259734)
IC50 9.27±n/a nM
Citation Eignerová, BSedlák, DDracínský, MBartunek, PKotora, M Synthesis and biochemical characterization of a series of 17a-perfluoroalkylated estradiols as selective ligands for estrogen receptora. J Med Chem53:6947-53 (2010) 
 
Mineralocorticoid receptor
Name:Mineralocorticoid receptor
Type:Enzyme
Mol. Mass.:107076.42
Organism:Homo sapiens (Human)
Description:P08235
Residue:984
BDBM19214
NameBDBM19214
Synonyms:(1S,2R,10S,11S,14S,15R,17S)-17-hydroxy-14-(2-hydroxyacetyl)-2-methyl-5-oxotetracyclo[8.7.0.0^{2,7}.0^{11,15}]heptadec-6-ene-15-carbaldehyde US10188667, Aldosterone | [3H]Aldosterone
TypeSteroid
Emp. Form.C21H28O5
Mol. Mass.360.444
SMILES[H][C@@]12CC[C@H](C(=O)CO)[C@]1(C[C@H](O)[C@@]1([H])[C@@]2([H])CCC2=CC(=O)CC[C@]12C)C=O