Reaction Details
TargetAcetylcholine-binding protein
LigandBDBM50417091
Substrate/Competitorn/a
Meas. Tech.ChEMBL_665339 (CHEMBL1261016)
Ki 562.34±n/a nM
Citation de Kloe, GERetra, KGeitmann, MKällblad, PNahar, Tvan Elk, RSmit, ABvan Muijlwijk-Koezen, JELeurs, RIrth, HDanielson, UHde Esch, IJ Surface plasmon resonance biosensor based fragment screening using acetylcholine binding protein identifies ligand efficiency hot spots (LE hot spots) by deconstruction of nicotinic acetylcholine receptora7 ligands. J Med Chem53:7192-201 (2010) 
 
Acetylcholine-binding protein
Name:Acetylcholine-binding protein
Type:n/a
Mol. Mass.:26055.52
Organism:Lymnaea stagnalis
Description:Soluble acetylcholine receptor
Residue:229
BDBM50417091
NameBDBM50417091
Synonyms:CHEMBL1258127
TypeSmall organic molecule
Emp. Form.C20H24N4O
Mol. Mass.336.4308
SMILESO=C(N[C@@H]1C2CCN(CC2)[C@H]1Cc1cccnc1)Nc1ccccc1