Reaction Details
TargetAcetylcholine-binding protein
LigandBDBM50417103
Substrate/Competitorn/a
Meas. Tech.ChEMBL_665339 (CHEMBL1261016)
Ki 251.19±n/a nM
Citation de Kloe, GERetra, KGeitmann, MKällblad, PNahar, Tvan Elk, RSmit, ABvan Muijlwijk-Koezen, JELeurs, RIrth, HDanielson, UHde Esch, IJ Surface plasmon resonance biosensor based fragment screening using acetylcholine binding protein identifies ligand efficiency hot spots (LE hot spots) by deconstruction of nicotinic acetylcholine receptora7 ligands. J Med Chem53:7192-201 (2010) 
 
Acetylcholine-binding protein
Name:Acetylcholine-binding protein
Type:n/a
Mol. Mass.:26055.52
Organism:Lymnaea stagnalis
Description:Soluble acetylcholine receptor
Residue:229
BDBM50417103
NameBDBM50417103
Synonyms:CHEMBL1256001
TypeSmall organic molecule
Emp. Form.C13H18N2O
Mol. Mass.218.2948
SMILESO[C@@H]1C2CCN(CC2)[C@H]1Cc1cccnc1