Reaction Details
TargetAcetylcholine-binding protein
LigandBDBM50161764
Substrate/Competitorn/a
Meas. Tech.ChEMBL_665337 (CHEMBL1261014)
Kd 3631±n/a nM
Citation de Kloe, GERetra, KGeitmann, MKällblad, PNahar, Tvan Elk, RSmit, ABvan Muijlwijk-Koezen, JELeurs, RIrth, HDanielson, UHde Esch, IJ Surface plasmon resonance biosensor based fragment screening using acetylcholine binding protein identifies ligand efficiency hot spots (LE hot spots) by deconstruction of nicotinic acetylcholine receptora7 ligands. J Med Chem53:7192-201 (2010) 
 
Acetylcholine-binding protein
Name:Acetylcholine-binding protein
Type:n/a
Mol. Mass.:26055.52
Organism:Lymnaea stagnalis
Description:Soluble acetylcholine receptor
Residue:229
BDBM50161764
NameBDBM50161764
Synonyms:(R)-4-chloro-N-(quinuclidin-3-yl)benzamide CHEMBL177611 PNU-282987 | PNU282987
TypeSmall organic molecule
Emp. Form.C14H17ClN2O
Mol. Mass.264.751
SMILESClc1ccc(cc1)C(=O)N[C@H]1CN2CCC1CC2