Reaction Details
TargetSodium-dependent serotonin transporter
LigandBDBM50417415
Substrate/Competitorn/a
Meas. Tech.ChEMBL_686391 (CHEMBL1293147)
Ki 3.98±n/a nM
Citation Bromidge, SMArban, RBertani, BBorriello, MCapelli, AMDi-Fabio, RFaedo, SGianotti, MGordon, LJGranci, EPasquarello, ASpada, SKWorby, AZonzini, LZucchelli, V 5-{2-[4-(2-methyl-5-quinolinyl)-1-piperazinyl]ethyl}-2(1H)-quinolinones and 3,4-dihydro-2(1H)-quinolinones: dual-acting 5-HT1 receptor antagonists and serotonin reuptake inhibitors. Part 3. Bioorg Med Chem Lett20:7092-6 (2010) 
 
Sodium-dependent serotonin transporter
Name:Sodium-dependent serotonin transporter
Type:Multi-pass membrane protein
Mol. Mass.:70322.51
Organism:Homo sapiens (Human)
Description:P31645
Residue:630
BDBM50417415
NameBDBM50417415
Synonyms:CHEMBL1289277
TypeSmall organic molecule
Emp. Form.C28H32N4O
Mol. Mass.440.5799
SMILESC[C@@H]1CN(CCN1CCc1c(C)ccc2n(C)c(=O)ccc12)c1cccc2nc(C)ccc12