Reaction Details
TargetTranscriptional regulator ERG
LigandBDBM50417413
Substrate/Competitorn/a
Meas. Tech.ChEMBL_686392 (CHEMBL1293148)
Ki 31622.78±n/a nM
Citation Bromidge, SMArban, RBertani, BBorriello, MCapelli, AMDi-Fabio, RFaedo, SGianotti, MGordon, LJGranci, EPasquarello, ASpada, SKWorby, AZonzini, LZucchelli, V 5-{2-[4-(2-methyl-5-quinolinyl)-1-piperazinyl]ethyl}-2(1H)-quinolinones and 3,4-dihydro-2(1H)-quinolinones: dual-acting 5-HT1 receptor antagonists and serotonin reuptake inhibitors. Part 3. Bioorg Med Chem Lett20:7092-6 (2010) 
 
Transcriptional regulator ERG
Name:Transcriptional regulator ERG
Type:PROTEIN
Mol. Mass.:54615.84
Organism:Homo sapiens (Human)
Description:ChEMBL_1335569
Residue:486
BDBM50417413
NameBDBM50417413
Synonyms:CHEMBL1289163
TypeSmall organic molecule
Emp. Form.C26H27FN4O
Mol. Mass.430.5172
SMILESCc1ccc2c(cccc2n1)N1CCN(CCc2c(F)ccc3n(C)c(=O)ccc23)CC1