Reaction Details
TargetTranscriptional regulator ERG
LigandBDBM50417418
Substrate/Competitorn/a
Meas. Tech.ChEMBL_686392 (CHEMBL1293148)
Ki 1258.93±n/a nM
Citation Bromidge, SMArban, RBertani, BBorriello, MCapelli, AMDi-Fabio, RFaedo, SGianotti, MGordon, LJGranci, EPasquarello, ASpada, SKWorby, AZonzini, LZucchelli, V 5-{2-[4-(2-methyl-5-quinolinyl)-1-piperazinyl]ethyl}-2(1H)-quinolinones and 3,4-dihydro-2(1H)-quinolinones: dual-acting 5-HT1 receptor antagonists and serotonin reuptake inhibitors. Part 3. Bioorg Med Chem Lett20:7092-6 (2010) 
 
Transcriptional regulator ERG
Name:Transcriptional regulator ERG
Type:PROTEIN
Mol. Mass.:54615.84
Organism:Homo sapiens (Human)
Description:ChEMBL_1335569
Residue:486
BDBM50417418
NameBDBM50417418
Synonyms:CHEMBL1289617
TypeSmall organic molecule
Emp. Form.C28H31FN4O
Mol. Mass.458.5703
SMILESC[C@H]1CN(CCN1CCc1c(C)ccc2n(C)c(=O)ccc12)c1cc(F)cc2nc(C)ccc12