Reaction Details
Target5-hydroxytryptamine receptor 1B
LigandBDBM50417427
Substrate/Competitorn/a
Meas. Tech.ChEMBL_686386 (CHEMBL1293142)
Ki 0.794±n/a nM
Citation Bromidge, SMArban, RBertani, BBorriello, MCapelli, AMDi-Fabio, RFaedo, SGianotti, MGordon, LJGranci, EPasquarello, ASpada, SKWorby, AZonzini, LZucchelli, V 5-{2-[4-(2-methyl-5-quinolinyl)-1-piperazinyl]ethyl}-2(1H)-quinolinones and 3,4-dihydro-2(1H)-quinolinones: dual-acting 5-HT1 receptor antagonists and serotonin reuptake inhibitors. Part 3. Bioorg Med Chem Lett20:7092-6 (2010) 
 
5-hydroxytryptamine receptor 1B
Name:5-hydroxytryptamine receptor 1B
Type:G Protein-Coupled Receptor (GPCR)
Mol. Mass.:43579.17
Organism:Homo sapiens (Human)
Description:Receptor binding assays were performed using human clone stably expressed in CHO cells
Residue:390
BDBM50417427
NameBDBM50417427
Synonyms:CHEMBL1290716
TypeSmall organic molecule
Emp. Form.C26H28N4O
Mol. Mass.412.5267
SMILESCc1ccc2c(cccc2n1)N1CCN(CCc2cccc3n(C)c(=O)ccc23)CC1