Reaction Details
Target5-hydroxytryptamine receptor 1D
LigandBDBM50417419
Substrate/Competitorn/a
Meas. Tech.ChEMBL_686387 (CHEMBL1293143)
Ki 0.501±n/a nM
Citation Bromidge, SMArban, RBertani, BBorriello, MCapelli, AMDi-Fabio, RFaedo, SGianotti, MGordon, LJGranci, EPasquarello, ASpada, SKWorby, AZonzini, LZucchelli, V 5-{2-[4-(2-methyl-5-quinolinyl)-1-piperazinyl]ethyl}-2(1H)-quinolinones and 3,4-dihydro-2(1H)-quinolinones: dual-acting 5-HT1 receptor antagonists and serotonin reuptake inhibitors. Part 3. Bioorg Med Chem Lett20:7092-6 (2010) 
 
5-hydroxytryptamine receptor 1D
Name:5-hydroxytryptamine receptor 1D
Type:G Protein-Coupled Receptor (GPCR)
Mol. Mass.:41920.63
Organism:Homo sapiens (Human)
Description:Receptor binding assays were performed using human clone stably expressed in CHO cells.
Residue:377
BDBM50417419
NameBDBM50417419
Synonyms:CHEMBL1289618
TypeSmall organic molecule
Emp. Form.C28H32N4O
Mol. Mass.440.5799
SMILESCc1ccc2c(cccc2n1)N1CCN(CCc2cccc3n(C)c(=O)ccc23)C(C)(C)C1