Reaction Details
TargetOxytocin receptor
LigandBDBM50299343
Substrate/Competitorn/a
Meas. Tech.ChEMBL_700576 (CHEMBL1648395)
Ki 1.51±n/a nM
Citation Smethurst, CABorthwick, JAGaines, SWatson, SGreen, ASchulz, MJBurton, GBuson, AAArban, R The characterization of a novel V1b antagonist lead series. Bioorg Med Chem Lett21:92-6 (2010) 
 
Oxytocin receptor
Name:Oxytocin receptor
Type:Enzyme Catalytic Domain
Mol. Mass.:42793.26
Organism:Homo sapiens (Human)
Description:Oxytocin OXTR HEK293::B2R9L7
Residue:389
BDBM50299343
NameBDBM50299343
Synonyms:(2S,4R)-1-((R)-5-chloro-1-(2,4-dimethoxyphenylsulfonyl)-3-(2-methoxyphenyl)-2-oxoindolin-3-yl)-4-hydroxy-N,N-dimethylpyrrolidine-2-carboxamide CHEMBL582857 SSR149415
TypeSmall organic molecule
Emp. Form.C30H32ClN3O8S
Mol. Mass.630.108
SMILESCOc1ccc(c(OC)c1)S(=O)(=O)N1C(=O)[C@@](N2C[C@H](O)C[C@H]2C(=O)N(C)C)(c2cc(Cl)ccc12)c1ccccc1OC