Reaction Details
TargetBeta-secretase 1
LigandBDBM50305480
Substrate/Competitorn/a
Meas. Tech.ChEMBL_715421 (CHEMBL1664806)
IC50 1079±n/a nM
Citation Li, ZZhou, MWu, FLi, RDing, Z Self-organizing molecular field analysis on humanß-secretase nonpeptide inhibitors: 5, 5-disubstituted aminohydantoins. Eur J Med Chem46:58-64 (2010) 
 
Beta-secretase 1
Name:Beta-secretase 1
Type:Protein
Mol. Mass.:55755.10
Organism:Homo sapiens (Human)
Description:P56817
Residue:501
BDBM50305480
NameBDBM50305480
Synonyms:2-amino-4-cyclohexyl-1-(3,5-difluorobenzyl)-4-phenyl-1H-imidazol-5(4H)-one | CHEMBL592533
TypeSmall organic molecule
Emp. Form.C22H23F2N3O
Mol. Mass.383.4343
SMILESNC1=NC(C2CCCCC2)(C(=O)N1Cc1cc(F)cc(F)c1)c1ccccc1