Reaction Details
TargetBeta-secretase 1
LigandBDBM50303727
Substrate/Competitorn/a
Meas. Tech.ChEMBL_715421 (CHEMBL1664806)
IC50 10±n/a nM
Citation Li, ZZhou, MWu, FLi, RDing, Z Self-organizing molecular field analysis on humanß-secretase nonpeptide inhibitors: 5, 5-disubstituted aminohydantoins. Eur J Med Chem46:58-64 (2010) 
 
Beta-secretase 1
Name:Beta-secretase 1
Type:Protein
Mol. Mass.:55755.10
Organism:Homo sapiens (Human)
Description:P56817
Residue:501
BDBM50303727
NameBDBM50303727
Synonyms:(4R)-2-amino-4-(4-fluoro-3-(2-fluoropyridin-3-yl)phenyl)-4-(4-methoxy-3-methylphenyl)-1-methyl-1H-imidazol-5(4H)-one | CHEMBL584695
TypeSmall organic molecule
Emp. Form.C23H20F2N4O2
Mol. Mass.422.4273
SMILESCOc1ccc(cc1C)[C@@]1(N=C(N)N(C)C1=O)c1ccc(F)c(c1)-c1cccnc1F