Reaction Details
TargetRho-associated protein kinase 2
LigandBDBM50417667
Substrate/Competitorn/a
Meas. Tech.ChEMBL_716635 (CHEMBL1670414)
IC50 91.2±n/a nM
Citation Ray, PWright, JAdam, JBoucharens, SBlack, DBrown, AREpemolu, OFletcher, DHuggett, MJones, PLaats, SLyons, Ade Man, JMorphy, RSherborne, BSherry, LStraten, NvWestwood, PYork, M Optimisation of 6-substituted isoquinolin-1-amine based ROCK-I inhibitors. Bioorg Med Chem Lett21:1084-8 (2011) 
 
Rho-associated protein kinase 2
Name:Rho-associated protein kinase 2
Type:Protein
Mol. Mass.:160885.43
Organism:Homo sapiens (Human)
Description:O75116
Residue:1388
BDBM50417667
NameBDBM50417667
Synonyms:CHEMBL1643574
TypeSmall organic molecule
Emp. Form.C21H23N3O
Mol. Mass.333.4268
SMILESNc1nccc2cc(O[C@H]3CCCN(Cc4ccccc4)C3)ccc12