Reaction Details
TargetCytochrome P450 2E1
LigandBDBM50240850
Substrate/Competitorn/a
Meas. Tech.ChEMBL_738342 (CHEMBL1743419)
Ki 9980±n/a nM
Citation Fontana, EDansette, PMPoli, SM Cytochrome p450 enzymes mechanism based inhibitors: common sub-structures and reactivity. Curr Drug Metab6:413-54 (2005) Cytochrome P450 2E1
Name:Cytochrome P450 2E1
Type:Enzyme
Mol. Mass.:56860.34
Organism:Homo sapiens (Human)
Description:P05181
Residue:493
BDBM50240850
NameBDBM50240850
Synonyms:(2-Isothiocyanato-ethyl)-benzene Phenethyl isothiocyanate phenylethyl isothiocyanate
TypeSmall organic molecule
Emp. Form.C9H9NS
Mol. Mass.163.239
SMILESS=C=NCCc1ccccc1