Reaction Details
TargetAurora kinase A
LigandBDBM50418165
Substrate/Competitorn/a
Meas. Tech.ChEMBL_741033 (CHEMBL1764219)
IC50 1258.93±n/a nM
Citation Miller, DDBamborough, PChristopher, JABaldwin, IRChampigny, ACCutler, GJKerns, JKLongstaff, TMellor, GWMorey, JVMorse, MANie, HRumsey, WLTaggart, JJ 3,5-Disubstituted-indole-7-carboxamides: the discovery of a novel series of potent, selective inhibitors of IKK-ß. Bioorg Med Chem Lett21:2255-8 (2011) 
 
Aurora kinase A
Name:Aurora kinase A
Type:Serine/threonine-protein kinase
Mol. Mass.:45830.98
Organism:Homo sapiens (Human)
Description:O14965
Residue:403
BDBM50418165
NameBDBM50418165
Synonyms:CHEMBL1761512
TypeSmall organic molecule
Emp. Form.C23H27N3O3S
Mol. Mass.425.544
SMILESCCCS(=O)(=O)N1CCC(CC1)c1c[nH]c2c(cc(cc12)-c1ccccc1)C(N)=O