Reaction Details
TargetSerine/threonine-protein kinase TBK1
LigandBDBM50418165
Substrate/Competitorn/a
Meas. Tech.ChEMBL_741024 (CHEMBL1764210)
IC50>3162.28±n/a nM
Citation Miller, DDBamborough, PChristopher, JABaldwin, IRChampigny, ACCutler, GJKerns, JKLongstaff, TMellor, GWMorey, JVMorse, MANie, HRumsey, WLTaggart, JJ 3,5-Disubstituted-indole-7-carboxamides: the discovery of a novel series of potent, selective inhibitors of IKK-ß. Bioorg Med Chem Lett21:2255-8 (2011) 
 
Serine/threonine-protein kinase TBK1
Name:Serine/threonine-protein kinase TBK1
Type:protein
Mol. Mass.:83645.20
Organism:Homo sapiens (Human)
Description:Q9UHD2
Residue:729
BDBM50418165
NameBDBM50418165
Synonyms:CHEMBL1761512
TypeSmall organic molecule
Emp. Form.C23H27N3O3S
Mol. Mass.425.544
SMILESCCCS(=O)(=O)N1CCC(CC1)c1c[nH]c2c(cc(cc12)-c1ccccc1)C(N)=O