Reaction Details
TargetInhibitor of nuclear factor kappa-B kinase subunit beta
LigandBDBM50418167
Substrate/Competitorn/a
Meas. Tech.ChEMBL_741019 (CHEMBL1764205)
IC50 25.12±n/a nM
Citation Miller, DDBamborough, PChristopher, JABaldwin, IRChampigny, ACCutler, GJKerns, JKLongstaff, TMellor, GWMorey, JVMorse, MANie, HRumsey, WLTaggart, JJ 3,5-Disubstituted-indole-7-carboxamides: the discovery of a novel series of potent, selective inhibitors of IKK-ß. Bioorg Med Chem Lett21:2255-8 (2011) 
 
Inhibitor of nuclear factor kappa-B kinase subunit beta
Name:Inhibitor of nuclear factor kappa-B kinase subunit beta
Type:Serine/threonine-protein kinase
Mol. Mass.:86554.39
Organism:Homo sapiens (Human)
Description:GST-tagged IKK-2 was expressed in High Five cells and purified.
Residue:756
BDBM50418167
NameBDBM50418167
Synonyms:CHEMBL1761514
TypeSmall organic molecule
Emp. Form.C22H25N3O3S
Mol. Mass.411.517
SMILESCCS(=O)(=O)N1CCC(CC1)c1c[nH]c2c(cc(cc12)-c1ccccc1)C(N)=O