Reaction Details
TargetInhibitor of nuclear factor kappa-B kinase subunit alpha
LigandBDBM50418174
Substrate/Competitorn/a
Meas. Tech.ChEMBL_741020 (CHEMBL1764206)
IC50 3981.07±n/a nM
Citation Miller, DDBamborough, PChristopher, JABaldwin, IRChampigny, ACCutler, GJKerns, JKLongstaff, TMellor, GWMorey, JVMorse, MANie, HRumsey, WLTaggart, JJ 3,5-Disubstituted-indole-7-carboxamides: the discovery of a novel series of potent, selective inhibitors of IKK-ß. Bioorg Med Chem Lett21:2255-8 (2011) 
 
Inhibitor of nuclear factor kappa-B kinase subunit alpha
Name:Inhibitor of nuclear factor kappa-B kinase subunit alpha
Type:PROTEIN
Mol. Mass.:84642.21
Organism:Homo sapiens (Human)
Description:ChEMBL_327453
Residue:745
BDBM50418174
NameBDBM50418174
Synonyms:CHEMBL1761501
TypeSmall organic molecule
Emp. Form.C16H15N3O3S
Mol. Mass.329.374
SMILESCS(=O)(=O)Nc1ccc(cc1)-c1cc(C(N)=O)c2[nH]ccc2c1