Reaction Details
TargetCannabinoid receptor 1
LigandBDBM50418222
Substrate/Competitorn/a
Meas. Tech.ChEMBL_740403 (CHEMBL1764461)
IC50 0.513±n/a nM
Citation Cowley, PMBaker, JBuchanan, KICarlyle, IClark, JKClarkson, TRDeehan, MEdwards, DKiyoi, YMartin, IOsbourn, DWalker, GWard, NWishart, G Pharmacokinetic optimisation of novel indole-2-carboxamide cannabinoid CB1 antagonists. Bioorg Med Chem Lett21:2034-9 (2011) 
 
Cannabinoid receptor 1
Name:Cannabinoid receptor 1
Type:G Protein-Coupled Receptor (GPCR)
Mol. Mass.:52868.96
Organism:Homo sapiens (Human)
Description:P21554
Residue:472
BDBM50418222
NameBDBM50418222
Synonyms:CHEMBL1760652
TypeSmall organic molecule
Emp. Form.C24H24F3N3O2
Mol. Mass.443.4615
SMILESCc1ccc(cc1Cn1c(cc2cc(ccc12)C#N)C(=O)NCC(C)(C)CO)C(F)(F)F