Reaction Details
TargetCannabinoid receptor 1
LigandBDBM50418225
Substrate/Competitorn/a
Meas. Tech.ChEMBL_740403 (CHEMBL1764461)
IC50 2±n/a nM
Citation Cowley, PMBaker, JBuchanan, KICarlyle, IClark, JKClarkson, TRDeehan, MEdwards, DKiyoi, YMartin, IOsbourn, DWalker, GWard, NWishart, G Pharmacokinetic optimisation of novel indole-2-carboxamide cannabinoid CB1 antagonists. Bioorg Med Chem Lett21:2034-9 (2011) 
 
Cannabinoid receptor 1
Name:Cannabinoid receptor 1
Type:G Protein-Coupled Receptor (GPCR)
Mol. Mass.:52868.96
Organism:Homo sapiens (Human)
Description:P21554
Residue:472
BDBM50418225
NameBDBM50418225
Synonyms:CHEMBL1760649
TypeSmall organic molecule
Emp. Form.C23H24ClN3O3
Mol. Mass.425.908
SMILESCOc1ccc(Cl)cc1Cn1c(cc2cc(ccc12)C#N)C(=O)NCC(C)(C)CO