Reaction Details
TargetCannabinoid receptor 2
LigandBDBM50418210
Substrate/Competitorn/a
Meas. Tech.ChEMBL_740402 (CHEMBL1764460)
Ki>10000±n/a nM
Citation Cowley, PMBaker, JBuchanan, KICarlyle, IClark, JKClarkson, TRDeehan, MEdwards, DKiyoi, YMartin, IOsbourn, DWalker, GWard, NWishart, G Pharmacokinetic optimisation of novel indole-2-carboxamide cannabinoid CB1 antagonists. Bioorg Med Chem Lett21:2034-9 (2011) 
 
Cannabinoid receptor 2
Name:Cannabinoid receptor 2
Type:G Protein-Coupled Receptor (GPCR)
Mol. Mass.:39690.94
Organism:Homo sapiens (Human)
Description:P34972
Residue:360
BDBM50418210
NameBDBM50418210
Synonyms:CHEMBL1760664
TypeSmall organic molecule
Emp. Form.C24H24F3N3O2
Mol. Mass.443.4615
SMILESCc1ccc(cc1Cn1c(cc2cc(ccc12)C#N)C(=O)NCCC(C)(C)O)C(F)(F)F