Reaction Details
TargetNociceptin receptor
LigandBDBM50418598
Substrate/Competitorn/a
Meas. Tech.ChEMBL_750576 (CHEMBL1786440)
Ki 59±n/a nM
Citation Trapella, CFischetti, CPela', MLazzari, IGuerrini, RCalo', GRizzi, ACamarda, VLambert, DGMcDonald, JRegoli, DSalvadori, S Structure-activity studies on the nociceptin/orphanin FQ receptor antagonist 1-benzyl-N-{3-[spiroisobenzofuran-1(3H),4'-piperidin-1-yl]propyl} pyrrolidine-2-carboxamide. Bioorg Med Chem17:5080-95 (2009) 
 
Nociceptin receptor
Name:Nociceptin receptor
Type:G Protein-Coupled Receptor (GPCR)
Mol. Mass.:40702.87
Organism:Homo sapiens (Human)
Description:P41146
Residue:370
BDBM50418598
NameBDBM50418598
Synonyms:CHEMBL1783818
TypeSmall organic molecule
Emp. Form.C24H31N3O2
Mol. Mass.393.5218
SMILESN[C@@H](Cc1ccccc1)C(=O)NCCCN1CCC2(CC1)OCc1ccccc21