Reaction Details
TargetSodium channel protein type 9 subunit alpha
LigandBDBM50418775
Substrate/Competitorn/a
Meas. Tech.ChEMBL_753412 (CHEMBL1799747)
IC50 58.88±n/a nM
Citation Macsari, ISandberg, LBesidski, YGravenfors, YGinman, TBylund, JBueters, TEriksson, ABLund, PEVenyike, EArvidsson, PI Phenyl isoxazole voltage-gated sodium channel blockers: structure and activity relationship. Bioorg Med Chem Lett21:3871-6 (2011) 
 
Sodium channel protein type 9 subunit alpha
Name:Sodium channel protein type 9 subunit alpha
Type:Protein
Mol. Mass.:226375.97
Organism:Homo sapiens (Human)
Description:Q15858
Residue:1988
BDBM50418775
NameBDBM50418775
Synonyms:CHEMBL1797413
TypeSmall organic molecule
Emp. Form.C24H26F3N3O4
Mol. Mass.477.4761
SMILESCc1onc(c1CC(=O)NCc1cccc(OCCOCC(F)(F)F)n1)-c1c(C)cccc1C