Reaction Details
TargetSodium channel protein type 9 subunit alpha
LigandBDBM50418792
Substrate/Competitorn/a
Meas. Tech.ChEMBL_753412 (CHEMBL1799747)
IC50 125.89±n/a nM
Citation Macsari, ISandberg, LBesidski, YGravenfors, YGinman, TBylund, JBueters, TEriksson, ABLund, PEVenyike, EArvidsson, PI Phenyl isoxazole voltage-gated sodium channel blockers: structure and activity relationship. Bioorg Med Chem Lett21:3871-6 (2011) 
 
Sodium channel protein type 9 subunit alpha
Name:Sodium channel protein type 9 subunit alpha
Type:Protein
Mol. Mass.:226375.97
Organism:Homo sapiens (Human)
Description:Q15858
Residue:1988
BDBM50418792
NameBDBM50418792
Synonyms:CHEMBL1797409
TypeSmall organic molecule
Emp. Form.C21H21Cl2N3O3
Mol. Mass.434.316
SMILESCC(C)Oc1ccc(CNC(=O)Cc2c(C)onc2-c2c(Cl)cccc2Cl)cn1