Reaction Details
TargetSodium channel protein type 9 subunit alpha
LigandBDBM50418784
Substrate/Competitorn/a
Meas. Tech.ChEMBL_753412 (CHEMBL1799747)
IC50 10.47±n/a nM
Citation Macsari, ISandberg, LBesidski, YGravenfors, YGinman, TBylund, JBueters, TEriksson, ABLund, PEVenyike, EArvidsson, PI Phenyl isoxazole voltage-gated sodium channel blockers: structure and activity relationship. Bioorg Med Chem Lett21:3871-6 (2011) 
 
Sodium channel protein type 9 subunit alpha
Name:Sodium channel protein type 9 subunit alpha
Type:Protein
Mol. Mass.:226375.97
Organism:Homo sapiens (Human)
Description:Q15858
Residue:1988
BDBM50418784
NameBDBM50418784
Synonyms:CHEMBL1797399
TypeSmall organic molecule
Emp. Form.C20H18ClFN2O3
Mol. Mass.388.82
SMILESCc1onc(c1NC(=O)OCc1c(F)cccc1Cl)-c1c(C)cccc1C