Reaction Details
TargetSodium channel protein type 9 subunit alpha
LigandBDBM50418791
Substrate/Competitorn/a
Meas. Tech.ChEMBL_753412 (CHEMBL1799747)
IC50 23.99±n/a nM
Citation Macsari, ISandberg, LBesidski, YGravenfors, YGinman, TBylund, JBueters, TEriksson, ABLund, PEVenyike, EArvidsson, PI Phenyl isoxazole voltage-gated sodium channel blockers: structure and activity relationship. Bioorg Med Chem Lett21:3871-6 (2011) 
 
Sodium channel protein type 9 subunit alpha
Name:Sodium channel protein type 9 subunit alpha
Type:Protein
Mol. Mass.:226375.97
Organism:Homo sapiens (Human)
Description:Q15858
Residue:1988
BDBM50418791
NameBDBM50418791
Synonyms:CHEMBL1797388
TypeSmall organic molecule
Emp. Form.C18H13Cl3N2O3
Mol. Mass.411.666
SMILESCc1onc(c1NC(=O)OCc1ccccc1Cl)-c1c(Cl)cccc1Cl