Reaction Details
TargetDeoxyuridine 5'-triphosphate nucleotidohydrolase, mitochondrial
LigandBDBM50190556
Substrate/Competitorn/a
Meas. Tech.ChEMBL_758853 (CHEMBL1810457)
Ki 1400±n/a nM
Citation Recio, EMusso-Buendía, AVidal, AERuda, GFKasinathan, GNguyen, CRuiz-Pérez, LMGilbert, IHGonzález-Pacanowska, D Site-directed mutagenesis provides insights into the selective binding of trityl derivatives to Plasmodium falciparum dUTPase. Eur J Med Chem46:3309-14 (2011) 
 
Deoxyuridine 5'-triphosphate nucleotidohydrolase, mitochondrial
Name:Deoxyuridine 5'-triphosphate nucleotidohydrolase, mitochondrial
Type:Enzyme
Mol. Mass.:26574.03
Organism:Homo sapiens (Human)
Description:P33316
Residue:252
BDBM50190556
NameBDBM50190556
Synonyms:1-(3-tritylaminopropyl)uracil | CHEMBL211905
TypeSmall organic molecule
Emp. Form.C26H25N3O2
Mol. Mass.411.4956
SMILESO=c1ccn(CCCNC(c2ccccc2)(c2ccccc2)c2ccccc2)c(=O)[nH]1