Reaction Details
TargetDeoxyuridine 5'-triphosphate nucleotidohydrolase, mitochondrial
LigandBDBM50190549
Substrate/Competitorn/a
Meas. Tech.ChEMBL_758853 (CHEMBL1810457)
Ki 5700±n/a nM
Citation Recio, EMusso-Buendía, AVidal, AERuda, GFKasinathan, GNguyen, CRuiz-Pérez, LMGilbert, IHGonzález-Pacanowska, D Site-directed mutagenesis provides insights into the selective binding of trityl derivatives to Plasmodium falciparum dUTPase. Eur J Med Chem46:3309-14 (2011) 
 
Deoxyuridine 5'-triphosphate nucleotidohydrolase, mitochondrial
Name:Deoxyuridine 5'-triphosphate nucleotidohydrolase, mitochondrial
Type:Enzyme
Mol. Mass.:26574.03
Organism:Homo sapiens (Human)
Description:P33316
Residue:252
BDBM50190549
NameBDBM50190549
Synonyms:1-[4-hydroxy-3-(tritylaminomethyl)butyl]uracil | CHEMBL378101
TypeSmall organic molecule
Emp. Form.C28H29N3O3
Mol. Mass.455.5482
SMILESOCC(CCn1ccc(=O)[nH]c1=O)CNC(c1ccccc1)(c1ccccc1)c1ccccc1