Reaction Details
TargetVasopressin V1a receptor
LigandBDBM50418909
Substrate/Competitorn/a
Meas. Tech.ChEMBL_758292 (CHEMBL1810823)
Ki 2.09±n/a nM
Citation Arbuckle, WBaker, JBarn, DBingham, MBrown, ABuchanan, KCraighead, MGoodwin, RGoutcher, SKiczun, MLyons, AMilne, RMontgomery, BNapier, SPresland, JSloan, HTurnbull, ZWishart, G Optimisation of pharmacokinetic properties to afford an orally bioavailable and selective V1A receptor antagonist. Bioorg Med Chem Lett21:4622-8 (2011) 
 
Vasopressin V1a receptor
Name:Vasopressin V1a receptor
Type:Enzyme Catalytic Domain
Mol. Mass.:47674.81
Organism:RAT
Description:VASOPRESSIN V1A AVPR1A RAT::P30560
Residue:424
BDBM50418909
NameBDBM50418909
Synonyms:CHEMBL1807270
TypeSmall organic molecule
Emp. Form.C28H35Cl2N3O2
Mol. Mass.516.502
SMILESCN(C)[C@H]1CC[C@@H](CC1)NC(=O)[C@@H](Cc1ccc(Cl)cc1)NC(=O)C1(CCC1)c1ccc(Cl)cc1