Reaction Details
TargetVasopressin V1a receptor
LigandBDBM50418926
Substrate/Competitorn/a
Meas. Tech.ChEMBL_758215 (CHEMBL1810552)
Ki 10.96±n/a nM
Citation Arbuckle, WBaker, JBarn, DBingham, MBrown, ABuchanan, KCraighead, MGoodwin, RGoutcher, SKiczun, MLyons, AMilne, RMontgomery, BNapier, SPresland, JSloan, HTurnbull, ZWishart, G Optimisation of pharmacokinetic properties to afford an orally bioavailable and selective V1A receptor antagonist. Bioorg Med Chem Lett21:4622-8 (2011) 
 
Vasopressin V1a receptor
Name:Vasopressin V1a receptor
Type:Receptor
Mol. Mass.:46820.18
Organism:Homo sapiens (Human)
Description:P37288
Residue:418
BDBM50418926
NameBDBM50418926
Synonyms:CHEMBL1807258
TypeSmall organic molecule
Emp. Form.C23H27Cl2N3O2
Mol. Mass.448.385
SMILESCN1CCC(CC1)NC(=O)[C@@H](Cc1ccc(Cl)cc1)NC(=O)Cc1ccc(Cl)cc1