Reaction Details
TargetHistamine H4 receptor
LigandBDBM50419048
Substrate/Competitorn/a
Meas. Tech.ChEMBL_766544 (CHEMBL1827025)
Ki 794.33±n/a nM
Citation Verheij, MHde Graaf, Cde Kloe, GENijmeijer, SVischer, HFSmits, RAZuiderveld, OPHulscher, SSilvestri, LThompson, AJvan Muijlwijk-Koezen, JELummis, SCLeurs, Rde Esch, IJ Fragment library screening reveals remarkable similarities between the G protein-coupled receptor histamine H4 and the ion channel serotonin 5-HT3A. Bioorg Med Chem Lett21:5460-4 (2011) 
 
Histamine H4 receptor
Name:Histamine H4 receptor
Type:G Protein-Coupled Receptor (GPCR)
Mol. Mass.:44517.02
Organism:Homo sapiens (Human)
Description:Binding assays were using CHO cells stably expressing hH4R receptors.
Residue:390
BDBM50419048
NameBDBM50419048
Synonyms:CHEMBL1824048
TypeSmall organic molecule
Emp. Form.C14H16ClN3
Mol. Mass.261.75
SMILESCN1CCC(CC1)=Cc1nc2ccc(Cl)cc2[nH]1