Reaction Details
TargetHistamine H4 receptor
LigandBDBM26390
Substrate/Competitorn/a
Meas. Tech.ChEMBL_766543 (CHEMBL1826889)
Ki 6.31±n/a nM
Citation Verheij, MHde Graaf, Cde Kloe, GENijmeijer, SVischer, HFSmits, RAZuiderveld, OPHulscher, SSilvestri, LThompson, AJvan Muijlwijk-Koezen, JELummis, SCLeurs, Rde Esch, IJ Fragment library screening reveals remarkable similarities between the G protein-coupled receptor histamine H4 and the ion channel serotonin 5-HT3A. Bioorg Med Chem Lett21:5460-4 (2011) 
 
Histamine H4 receptor
Name:Histamine H4 receptor
Type:G Protein-Coupled Receptor (GPCR)
Mol. Mass.:44517.02
Organism:Homo sapiens (Human)
Description:Binding assays were using CHO cells stably expressing hH4R receptors.
Residue:390
BDBM26390
NameBDBM26390
Synonyms:4-(4-methylpiperazin-1-yl)-6-phenylpyrimidin-2-amine | 6-aryl-2-aminopyrimidine, 3
TypeSmall organic molecule
Emp. Form.C15H19N5
Mol. Mass.269.3449
SMILESCN1CCN(CC1)c1cc(nc(N)n1)-c1ccccc1