Reaction Details
TargetPotassium/sodium hyperpolarization-activated cyclic nucleotide-gated channel 4
LigandBDBM50419082
Substrate/Competitorn/a
Meas. Tech.ChEMBL_767271 (CHEMBL1825383)
IC50 79432.82±n/a nM
Citation McClure, KJMaher, MWu, NChaplan, SREckert, WALee, DHWickenden, ADHermann, MAllison, BHawryluk, NBreitenbucher, JGGrice, CA Discovery of a novel series of selective HCN1 blockers. Bioorg Med Chem Lett21:5197-201 (2011) 
 
Potassium/sodium hyperpolarization-activated cyclic nucleotide-gated channel 4
Name:Potassium/sodium hyperpolarization-activated cyclic nucleotide-gated channel 4
Type:PROTEIN
Mol. Mass.:129069.19
Organism:Homo sapiens (Human)
Description:ChEMBL_1454251
Residue:1203
BDBM50419082
NameBDBM50419082
Synonyms:CHEMBL1823877
TypeSmall organic molecule
Emp. Form.C23H37N3O
Mol. Mass.371.5594
SMILESCCc1ccccc1C(=O)NCC1(CCCCC1)N1CCN(CC1)C(C)C