Reaction Details
TargetPotassium/sodium hyperpolarization-activated cyclic nucleotide-gated channel 4
LigandBDBM50419055
Substrate/Competitorn/a
Meas. Tech.ChEMBL_767271 (CHEMBL1825383)
IC50 5011.87±n/a nM
Citation McClure, KJMaher, MWu, NChaplan, SREckert, WALee, DHWickenden, ADHermann, MAllison, BHawryluk, NBreitenbucher, JGGrice, CA Discovery of a novel series of selective HCN1 blockers. Bioorg Med Chem Lett21:5197-201 (2011) 
 
Potassium/sodium hyperpolarization-activated cyclic nucleotide-gated channel 4
Name:Potassium/sodium hyperpolarization-activated cyclic nucleotide-gated channel 4
Type:PROTEIN
Mol. Mass.:129069.19
Organism:Homo sapiens (Human)
Description:ChEMBL_1454251
Residue:1203
BDBM50419055
NameBDBM50419055
Synonyms:CHEMBL1823666
TypeSmall organic molecule
Emp. Form.C24H31N3O2
Mol. Mass.393.5218
SMILESCCOc1ccccc1C(=O)NCC1(Cc2ccccc2C1)N1CCN(C)CC1