Reaction Details
TargetAurora kinase B
LigandBDBM50419256
Substrate/Competitorn/a
Meas. Tech.ChEMBL_772964 (CHEMBL1838852)
IC50 6310±n/a nM
Citation Liddle, JAtkinson, FLBarker, MDCarter, PSCurtis, NRDavis, RPDouault, CDickson, MCElwes, DGarton, NSGray, MHayhow, TGHobbs, CIJones, ELeach, SLeavens, KLewis, HDMcCleary, SNeu, MPatel, VKPreston, AGRamirez-Molina, CShipley, TJSkone, PASmithers, NSomers, DOWalker, ALWatson, RJWeingarten, GG Discovery of GSK143, a highly potent, selective and orally efficacious spleen tyrosine kinase inhibitor. Bioorg Med Chem Lett21:6188-94 (2011) 
 
Aurora kinase B
Name:Aurora kinase B
Type:Protein
Mol. Mass.:39327.72
Organism:Homo sapiens (Human)
Description:Q96GD4
Residue:344
BDBM50419256
NameBDBM50419256
Synonyms:CHEMBL1835065 | US9579320, Example 302
TypeSmall organic molecule
Emp. Form.C17H22N6O2
Mol. Mass.342.3956
SMILESCc1cccc(Nc2nc(N[C@@H]3CCOC[C@@H]3N)ncc2C(N)=O)c1