Reaction Details
TargetMitogen-activated protein kinase 1/3
LigandBDBM50419259
Substrate/Competitorn/a
Meas. Tech.ChEMBL_772881 (CHEMBL1838284)
IC50 126±n/a nM
Citation Liddle, JAtkinson, FLBarker, MDCarter, PSCurtis, NRDavis, RPDouault, CDickson, MCElwes, DGarton, NSGray, MHayhow, TGHobbs, CIJones, ELeach, SLeavens, KLewis, HDMcCleary, SNeu, MPatel, VKPreston, AGRamirez-Molina, CShipley, TJSkone, PASmithers, NSomers, DOWalker, ALWatson, RJWeingarten, GG Discovery of GSK143, a highly potent, selective and orally efficacious spleen tyrosine kinase inhibitor. Bioorg Med Chem Lett21:6188-94 (2011) 
 
Mitogen-activated protein kinase 1/3
Name:Mitogen-activated protein kinase 1/3
Type:n/a
Mol. Mass.:n/a
Description:ASSAY_ID of ChEMBL is 124147
Components:This complex has 2 components.
Component 1
Name:Mitogen-activated protein kinase 1
Synonyms:ERK2 Extracellular signal-regulated kinase 2 Extracellular signal-regulated kinase 2 (ERK2) MAPK 2 MK01_HUMAN Mitogen-activated protein kinase 1 (ERK-2) Mitogen-activated protein kinase 2 PRKM2 | p42-MAPK
Type:Ser/Thr Protein Kinase
Mol. Mass.:41392.76
Organism:Homo sapiens (Human)
Description:P28482
Residue:360
Component 2
Name:Mitogen-activated protein kinase 3
Synonyms:ERK1 Extracellular signal-regulated kinase 1 MAP kinase ERK1 MAPK3/MAPK7 Mitogen-activated protein kinase PRKM3
Type:Protein
Mol. Mass.:43136.58
Organism:Homo sapiens (Human)
Description:curated by PDB 4QTB
Residue:379
BDBM50419259
NameBDBM50419259
Synonyms:CHEMBL1835072
TypeSmall organic molecule
Emp. Form.C17H22N6O3
Mol. Mass.358.395
SMILESCOc1ccc(Nc2nc(N[C@@H]3CCOC[C@@H]3N)ncc2C(N)=O)cc1