Reaction Details
TargetAurora kinase B
LigandBDBM50396073
Substrate/Competitorn/a
Meas. Tech.ChEMBL_772964 (CHEMBL1838852)
IC50 3981±n/a nM
Citation Liddle, JAtkinson, FLBarker, MDCarter, PSCurtis, NRDavis, RPDouault, CDickson, MCElwes, DGarton, NSGray, MHayhow, TGHobbs, CIJones, ELeach, SLeavens, KLewis, HDMcCleary, SNeu, MPatel, VKPreston, AGRamirez-Molina, CShipley, TJSkone, PASmithers, NSomers, DOWalker, ALWatson, RJWeingarten, GG Discovery of GSK143, a highly potent, selective and orally efficacious spleen tyrosine kinase inhibitor. Bioorg Med Chem Lett21:6188-94 (2011) 
 
Aurora kinase B
Name:Aurora kinase B
Type:Protein
Mol. Mass.:39327.72
Organism:Homo sapiens (Human)
Description:Q96GD4
Residue:344
BDBM50396073
NameBDBM50396073
Synonyms:CHEMBL1235110
TypeSmall organic molecule
Emp. Form.C18H24N6O
Mol. Mass.340.4228
SMILESCc1cccc(Nc2nc(N[C@@H]3CCCC[C@@H]3N)ncc2C(N)=O)c1