Reaction Details
TargetTyrosine-protein kinase SYK
LigandBDBM50419255
Substrate/Competitorn/a
Meas. Tech.ChEMBL_772965 (CHEMBL1838853)
IC50 79±n/a nM
Citation Liddle, JAtkinson, FLBarker, MDCarter, PSCurtis, NRDavis, RPDouault, CDickson, MCElwes, DGarton, NSGray, MHayhow, TGHobbs, CIJones, ELeach, SLeavens, KLewis, HDMcCleary, SNeu, MPatel, VKPreston, AGRamirez-Molina, CShipley, TJSkone, PASmithers, NSomers, DOWalker, ALWatson, RJWeingarten, GG Discovery of GSK143, a highly potent, selective and orally efficacious spleen tyrosine kinase inhibitor. Bioorg Med Chem Lett21:6188-94 (2011) 
 
Tyrosine-protein kinase SYK
Name:Tyrosine-protein kinase SYK
Type:Enzyme
Mol. Mass.:72079.99
Organism:Homo sapiens (Human)
Description:P43405
Residue:635
BDBM50419255
NameBDBM50419255
Synonyms:CHEMBL1835064
TypeSmall organic molecule
Emp. Form.C18H24N6O
Mol. Mass.340.4228
SMILESCc1cccc(Nc2nc(N[C@H]3CCCC[C@H]3N)ncc2C(N)=O)c1