Reaction Details
TargetHistamine H1 receptor
LigandBDBM50419328
Substrate/Competitorn/a
Meas. Tech.ChEMBL_775917 (CHEMBL1912890)
Ki 776.25±n/a nM
Citation Wagner, EWittmann, HJElz, SStrasser, A Mepyramine-JNJ7777120-hybrid compounds show high affinity to hH(1)R, but low affinity to hH(4)R. Bioorg Med Chem Lett21:6274-80 (2011) 
 
Histamine H1 receptor
Name:Histamine H1 receptor
Type:G Protein-Coupled Receptor (GPCR)
Mol. Mass.:55808.72
Organism:Homo sapiens (Human)
Description:Cell pellets from SK-N-MC cells transfected with human H1 receptor were used in binding assay.
Residue:487
BDBM50419328
NameBDBM50419328
Synonyms:CHEMBL1910379
TypeSmall organic molecule
Emp. Form.C28H30ClN5O2
Mol. Mass.504.023
SMILESCOc1ccc(CN(CCN2CCN(CC2)C(=O)c2cc3cc(Cl)ccc3[nH]2)c2ccccn2)cc1